{"text_format":"3","workbook":"xlsx","n_sheets":2,"sheets":["查询表","成绩表"],"not_rendered":{"defined_names":2},"read":"whole","date_system":"1900"}

{"sheet":"查询表","index":0,"n_rows":7,"n_cols":7,"rows_kept":7,"merged":[[0,1,2,6],[6,1,6,2]]}
[null,"附件：  遂溪县遂城街道2024年村级后备干部招录笔试成绩及入围面试人员名单"]
[]
[]
[null,"下方输入准考证号","姓名","性别","入党时间","笔试成绩","是否进入面试环节"]
[null,null,{"$f":"VLOOKUP(B5,成绩表!B:G,2,0)","v":{"$error":"#N/A"}},{"$f":"VLOOKUP(B5,成绩表!B:G,3,0)","v":{"$error":"#N/A"}},{"$f":"VLOOKUP(B5,成绩表!B:G,4,0)","v":{"$error":"#N/A"}},{"$f":"VLOOKUP(B5,成绩表!B:G,5,0)","v":{"$error":"#N/A"}},{"$f":"VLOOKUP(B5,成绩表!B:G,6,0)","v":{"$error":"#N/A"}}]
[]
[null,"注意：准考证号填写注意区分大小写"]

{"sheet":"成绩表","index":1,"n_rows":76,"n_cols":8,"rows_kept":76,"hidden":true,"merged":[[0,0,0,7]]}
["附件：  \n  遂溪县遂城街道2024年村级后备干部招录笔试成绩及入围面试人员名单"]
["序号","准考证","姓名","性别","入党时间","笔试成绩","是否进入面试环节","备注"]
[1,"SC001097383","刘莹莹","女","无",66,"是"]
[2,"SC001097323","罗嘉慧","女","无",57,"是"]
[3,"SC00109733X","陈锦豪","男","无",50,"是"]
[4,"SC001097355","周金诚","男","无",45,"否"]
[5,"SC001097315","吴龙明","男",2020.12,45,"否"]
[6,"SC001097311","吴振国","男","无",44,"否"]
[7,"SC001257342","梁冰","女","无",68,"是"]
[8,"SC001257346","梁珊","女","无",63,"是"]
[9,"SC001250045","陈小恒","女","无",59,"是"]
[10,"SC00125033X","肖如春","男","无",58,"是"]
[11,"SC001252021","刘婧如","女","无",54,"是"]
[12,"SC001087325","陈颖怡","女","无",68,"是"]
[13,"SC00108001X","叶寄誉","男","无",53,"是"]
[14,"SC001080644","蔡小玉","女","无",34,"否"]
[15,"SC001047323","杜思敏","女","无",49,"是"]
[16,"SC001040040","黄慧怡","女","无",42.5,"是"]
[17,"SC001160622","赵思敏","女","无",60,"是"]
[18,"SC001160847","徐日青","女","无",50,"是"]
[19,"SC001160042","赖雅莹","女","无",43,"是"]
[20,null,"赵华明","男","无",null,"否"]
[21,"SC001220023","陈雪婷","女","无",53,"是"]
[22,"SC001220049","朱杨梅","女",2018.12,50.5,"是"]
[23,"SC001224940","全叶生","女","无",48,"是"]
[24,"SC001030029","陈田英","女","无",57,"是"]
[25,"SC001031247","谢秋更","女","无",46,"是"]
[26,"SC00103001X","黄敬翔","男","无",45.5,"是"]
[27,"SC001180618","李贤泽","男","无",56,"是"]
[28,"SC001180639","罗素康","男","无",54,"是"]
[29,"SC001180620","龙艳云","女","无",54,"是"]
[30,"SC001240624","王梦霞","女","无",59,"是"]
[31,"SC001171249","郑燕霞","女","无",66,"是"]
[32,"SC001170056","何日旺","男","无",56,"是"]
[33,"SC001170610","黄景荣","男","无",47,"是"]
[34,"SC001210406","韩光玲","女","无",47,"是"]
[35,"SC001210339","余炳刚","男","无",44,"是"]
[36,"SC001050027","吴小艳","女","无",67,"是"]
[37,"SC001051722","黄晶晶","女","无",52,"是"]
[38,null,"卜晓玲","女","无",null,"否"]
[39,"SC001017333","谢耀松","男","无",66,"是"]
[40,"SC001010028","全静怡","女",2020.11,57,"是"]
[41,"SC001010022","林楚雯","女","无",31.5,"否"]
[42,"SC001140342","邹丽君","女","无",71,"是"]
[43,"SC001140310","陈奕翰","男",{"v":2023.09,"d":"2023.1"},65,"是"]
[44,"SC001147320","蔡诗婷","女","无",51,"是"]
[45,"SC001197315","陈天宇","男","无",69,"是"]
[46,null,"陈慧静","女","无",null,"否"]
[47,null,"陈子敬","男","无",null,"否"]
[48,"SC001200014","张立泓","男","无",71,"是"]
[49,"SC00120532X","陈沅杏","女","无",65,"是"]
[50,"SC001200028","韩敏敏","女","无",58,"是"]
[51,"SC001200037","陈冠宇","男","无",57,"是"]
[52,"SC001207342","梁娜英","女",2017.12,55,"是"]
[53,"SC00120032X","黄秋妙","女","无",53,"是"]
[54,"SC001206216","叶宇杰","男","无",50,"是"]
[55,"SC001200035","陈宇轩","男","无",46,"是"]
[56,"SC00120432X","庞日梅","女","无",45,"是"]
[57,"SC001207315","陈素钦","男","无",43,"是"]
[58,"SC00120004X","赖惠媚","女","无",39,"否"]
[59,null,"钟楚瑜","女","无",null,"否"]
[60,"SC001230322","陈文卿","女","无",58,"是"]
[61,"SC001237312","麦锐寰","男","无",55,"是"]
[62,"SC001237333","梁华志","男","无",51,"是"]
[63,"SC001150043","卢景艳","女","无",66,"是"]
[64,"SC001157315","李海龙","男",2012.06,56,"是"]
[65,"SC001157334","梁景军","男",2022.1,55,"是"]
[66,"SC001150041","王雯雯","女","无",53,"是"]
[67,"SC001150068","袁碧华","女","无",53,"是"]
[68,"SC001150023","徐雅莹","女","无",51,"是"]
[69,"SC001150338","李志聪","男","无",48,"是"]
[70,"SC001151882","温志梅","女",2009.4,48,"是"]
[71,"SC001150069","赖雅倩","女","无",45,"是"]
[72,"SC001150323","尹海燕","女","无",43,"是"]
[73,"SC001150050","简宏宇","男","无",40,"是"]
[74,"SC001020340","钟景玲","女","无",39,"否"]